{"text_format":"1","workbook":"xlsx","n_sheets":4,"sheets":["Toolkit Trial Balance","Schedules","Parishioner Report Template","YE Memo & Rest. Definitions"],"not_rendered":{"charts":0,"images":2,"macros":1,"external_links":1,"defined_names":88,"comments":0,"pivot_tables":0},"unopened":[],"bounds":{"document_bytes":16777216,"sheet_cells":100000,"rows_first":2000,"rows_last":500,"rows_between":2000,"halvings":0,"cell_chars":16384,"cell_head_chars":4096},"cells_cut":0,"cells_raw":0,"read":"whole","date_system":"1900"}

{"sheet":"Toolkit Trial Balance","index":0,"n_rows":431,"n_cols":15,"rows_kept":431,"cut":false,"hidden":false,"merged":[[299,0,299,2],[291,0,291,8],[290,0,290,8],[33,6,33,7],[33,5,34,5],[39,1,39,7],[0,0,0,3],[16,0,16,3],[1,0,1,3],[12,0,12,3],[13,1,13,3],[14,1,14,3],[6,1,6,2],[7,1,7,2],[8,1,8,2],[9,0,9,3],[39,11,39,15],[38,14,38,15],[4,0,4,3],[10,0,10,3],[17,1,17,3],[18,1,18,3],[19,1,19,3],[32,0,32,8],[20,1,20,3],[27,0,27,2],[22,10,22,11],[23,10,23,11],[24,10,24,11],[25,10,25,11]]}
["INTRODUCTION",null,null,null,null,null,null,null,null,"Hide this column before distributing"]
["The purpose of this Toolkit is to streamline the preparation of the annual report to the Diocese of Cleveland by minimizing the duplication of data entry and to automate the summarization of the data input to the trial balances below into the report document that will also act as a model financial report that the parish may wish to present to its parishioners.",null,null,null,null,null,null,null,null,"This column contains instructions for the Diocese for use when updating the Trial Balance spreadsheet to ensure that all row and column references are correct."]
[]
["The Toolkit consists of the following tabs:"]
["Toolkit Trial Balance (GREEN TAB)--this is the current tab and provides space to insert the basic financial information using the Diocese's chart of accounts.  You need to insert the requested financial information described below in the respective columns for the following periods (Enter data only in the cells highlighted in yellow or green--do not add any lines to this tab - DO NOT USE CUT AND PASTE):"]
["Column"]
["G","Current year\n    ended",null,"2021-06-30",null,null,null,null,null,"Must change dates each year and ensure column reference is correct"]
["H","Prior year\n    ended",null,"2020-06-30",null,null,null,null,null,"Must change dates each year and ensure column reference is correct"]
["I","Budget for year\n    ending",null,"2022-06-30",null,null,null,null,null,"Must change dates each year and ensure column reference is correct"]
["Schedules (BLUE TAB)--this is the tab for the spreadsheet in which you must enter selected supplemental information required by the Diocese.  At the top of that spreadsheet there is a table that indicates based on the information you have provided on the Toolkit Trial Balance tab the schedules that your parish is required to complete.  Enter data only in the cells highlighted in yellow.  Insert rows as necessary on this tab."]
["Parishioner Report Template (RED TAB)--this tab represents your parish's summary financial financial information for the current fiscal year ended June 30 as well as for the immediately preceding fiscal year and the budget for the coming fiscal year.  The information contained in this tab has been automatically extracted from the information you entered into the Toolkit Trial Balance tab - you should make no entries on the Parishioner Report Template tab.  The Statements of Assets, Liabilities and Fund Balance, and the Statements of Revenues and Expenses for the Church, School and Cemetery, appearing on the Parishioner Report Template tab contain the minimum information that a parish must include in its annual report to its parishioners.  In preparing its annual report to its parishioners from the information on this tab, a parish should delete any Statements of Revenue and Expenses (e.g. School and/or Cemetery) as well as any line items in the statements that are not applicable to the parish and my add line items to the extent the parish deems appropriate to convey the nature of its operations.  Additionally, in reporting to parishioners, a parish may combine any individual line items that do not exceed $5,000 with other line items to keep the amounts reported to relevant amounts.  To the extent that the Accounts Payable and Accrued Expenses includes an amount payable to the Diocese, the parish is encouraged to show that amount separately in its Statement of Assets, Liabilities and Fund Balance."]
[]
["Viewing and printing financial statements included in report to Diocese--your parish's Financial Report to the Diocese consists of the Statement of Assets, Liabilities and Fund Balance and the Statements of Operations for your Church, School and Cemetery that appear below, starting with row 287 and the exhibits from the accompany blue tab.  To view and/or print the respective statements, please press the appropriate button below:",null,null,null,null,null,null,null,null,"Must ensure that row number reference is unchanged"]
[]
[]
[]
["INSTRUCTIONS FOR USE OF TOOLKIT"]
[1,"Entering Parish Identity Information--enter in the cells highlighted in yellow in rows 24 through 31 the parish identity information",null,null,null,null,null,null,null,"Must ensure that row reference is correct"]
[2,"Entering Financial Data--in columns G and H enter the balance sheet and income statement trial balance information for the periods indicated in the respective cells.  In column I enter the budgeted income statement information for the period indicated.  With respect to column I, if your parish does not prepare its budget using the detailed account numbers from the Diocesan chart of accounts, input the data in the caption that most closely describes the nature of the budgeted item.",null,null,null,null,null,null,null,"Must ensure column reference is correct"]
[3,"Derivation of Fund Balance at Beginning of Period--row 62 balance sheet section below requires that the \"Fund balance at the beginning of the period\" be entered in columns G and H.  The \"Fund balance at the beginning of the period\" is the difference between the total assets and total liabilities at the end of the prior period.  This amount is sometimes referred to as net worth or net equity.  If total liabilities exceed total assets, the amount should be entered as a negative number.",null,null,null,null,null,null,null,"Must ensure that row and column references are correct"]
[4,"Determining if Financial Data is in Balance and Completion of Schedules--once it is determined that columns G and H are in balance (see row 37 that indicates whether the respective columns are in balance) and you have entered the budget information for the coming fiscal year in column I, Go to the Schedules tab and complete the schedules required for your parish as indicated by the table at the top of the Schedules spreadsheet.",null,null,null,null,null,null,null,"Must ensure that row and column references are correct"]
[]
[null,null,null,null,null,null,null,"Operating",null,null,"TOAL"]
["NAME OF PARISH",null,null,null,null,null,{"$f":"SUM(I73:I84)-SUM(I94:I158)","v":0},"Parish Budget",{"$f":"I173","v":0},null,"Parish Budget"]
["ADDRESS",null,null,null,null,null,{"$f":"SUM(I176:I188)-SUM(I197:I266)","v":0},"School Budget",{"$f":"I280","v":0},null,"School Budget"]
["CITY, STATE, ZIP CODE",null,null,null,null,null,{"$f":"SUM(I283-SUM(I284))","v":0},"Cemetery Budget",{"$f":"I285","v":0},null,"Cemetery Budget"]
["PARISH NUMBER",null,null,null,null,null,"Deficits will show in red."]
["PERSON TO CONTACT\n  WITH QUESTIONS:"]
[null,"Name"]
[null,"Telephone"]
{"$rows_left_out":402}
{"sheet":"Schedules","index":1,"n_rows":757,"n_cols":8,"rows_kept":757,"cut":false,"hidden":false,"merged":[[11,4,11,5],[741,0,741,3],[742,0,742,3],[743,0,743,3],[744,0,744,3],[745,0,745,3],[746,0,746,3],[740,0,740,3],[756,0,756,3],[755,0,755,2],[748,0,748,3],[749,0,749,3],[750,0,750,3],[751,0,751,3],[752,0,752,3],[753,0,753,3],[747,0,747,3],[687,0,687,4],[691,0,691,3],[692,0,692,3],[693,0,693,3],[694,0,694,3],[695,0,695,3],[708,0,708,3],[735,0,735,4],[739,0,739,3],[702,0,702,3],[703,0,703,3],[704,0,704,3],[711,0,711,3],[713,0,713,4],[714,0,714,4],[717,0,717,3],[718,0,718,3],[736,0,736,4],[705,0,705,3],[706,0,706,3],[707,0,707,3],[696,0,696,3],[697,0,697,3],[698,0,698,3],[246,0,246,3],[609,0,609,4],[610,0,610,4],[611,0,611,4],[612,0,612,4],[203,0,203,3],[242,0,242,3],[309,0,309,4],[358,0,358,4],[231,0,231,3],[217,0,217,4],[223,0,223,2],[228,0,228,3],[542,0,542,4],[451,0,451,4],[452,0,452,4],[442,0,442,3],[540,0,540,4],[501,0,501,4],[474,0,474,3],[475,0,475,3],[488,0,488,3],[252,0,252,3],[250,0,250,3],[280,0,280,3],[271,0,271,3],[320,0,320,3],[284,0,284,3],[274,0,274,3],[291,0,291,3],[292,0,292,3],[293,0,293,3],[276,0,276,3],[281,0,281,3],[275,0,275,3],[282,0,282,3],[272,0,272,3],[295,0,295,3],[296,0,296,3],[317,0,317,3],[318,0,318,3],[319,0,319,3],[314,0,314,3],[286,0,286,3],[306,0,306,4],[356,0,356,4],[350,0,350,3],[193,0,193,4],[195,0,195,4],[212,0,212,3],[211,0,211,3],[215,0,215,3],[240,0,240,3],[262,0,262,4],[204,0,204,3],[198,0,199,3],[247,0,247,3],[243,0,243,3],[248,0,248,3],[244,0,244,3],[245,0,245,3],[249,0,249,3],[253,0,253,3],[260,0,260,4],[202,0,202,3],[224,0,224,3],[221,0,221,4],[229,0,229,3],[251,0,251,3],[543,0,543,4],[511,0,511,3],[264,0,264,4],[448,0,448,3],[450,0,450,4],[445,0,445,3],[441,0,441,3],[285,0,285,3],[290,0,290,3],[287,0,287,3],[288,0,288,3],[294,0,294,3],[283,0,283,3],[321,0,321,3],[322,0,322,3],[323,0,323,3],[301,0,301,3],[312,0,313,2],[312,3,313,3],[308,0,308,4],[324,0,324,3],[298,0,298,3],[299,0,299,3],[300,0,300,3],[10,0,10,2],[11,0,11,2],[12,0,12,2],[14,0,14,2],[544,0,544,4],[541,0,541,4],[535,0,535,3],[534,0,534,3],[504,0,504,3],[465,0,465,3],[466,0,466,3],[467,0,467,3],[472,0,472,3],[470,0,470,3],[471,0,471,3],[515,0,515,3],[516,0,516,3],[517,0,517,3],[518,0,518,3],[519,0,519,3],[520,0,520,3],[521,0,521,3],[522,0,522,3],[537,0,537,2],[270,0,270,3],[289,0,289,3],[315,0,315,3],[316,0,316,3],[0,0,0,4],[2,2,2,4],[3,2,3,4],[122,0,122,3],[146,0,146,3],[4,2,4,4],[5,2,5,4],[6,2,6,4],[75,0,75,4],[28,0,28,4],[76,0,76,4],[124,0,124,4],[32,0,32,4],[8,0,8,4],[121,0,121,2],[126,0,126,4],[29,0,29,4],[125,0,125,4],[30,0,30,4],[31,0,31,4],[261,0,261,4],[266,0,267,2],[279,0,279,3],[538,0,538,3],[232,0,232,3],[233,0,233,3],[234,0,234,3],[235,0,235,3],[236,0,236,3],[241,0,241,3],[325,0,325,3],[297,0,297,3],[361,3,362,3],[263,0,263,4],[273,0,273,3],[254,0,254,3],[266,3,267,3],[258,0,258,3],[277,0,277,3],[278,0,278,3],[342,0,342,3],[255,0,255,3],[268,0,268,3],[269,0,269,3],[149,0,149,4],[150,0,150,4],[225,0,225,3],[151,0,151,4],[163,0,163,3],[164,0,164,3],[165,0,165,3],[205,0,205,3],[545,0,545,4],[361,0,362,2],[310,0,310,4],[510,0,510,3],[230,0,230,3],[304,0,304,3],[194,0,194,4],[196,0,196,4],[210,0,210,3],[209,0,209,3],[208,0,208,3],[237,0,237,3],[238,0,238,3],[239,0,239,3],[222,0,222,4],[207,0,207,3],[220,0,220,4],[162,0,162,3],[166,0,166,3],[167,0,167,3],[168,0,168,3],[183,0,183,3],[171,0,171,3],[172,0,172,3],[206,0,206,3],[201,0,201,3],[218,0,218,4],[219,0,219,4],[169,0,169,3],[170,0,170,3],[173,0,173,3],[174,0,174,3],[326,0,326,3],[327,0,327,3],[328,0,328,3],[329,0,329,3],[330,0,330,3],[331,0,331,3],[332,0,332,3],[333,0,333,3],[334,0,334,3],[335,0,335,3],[336,0,336,3],[337,0,337,3],[338,0,338,3],[339,0,339,3],[340,0,340,3],[341,0,341,3],[347,0,347,3],[348,0,348,3],[349,0,349,3],[307,0,307,4],[352,0,352,2],[359,0,359,4],[345,0,345,3],[390,0,390,3],[343,0,343,3],[365,0,365,3],[366,0,366,3],[346,0,346,3],[383,0,383,3],[372,0,372,3],[373,0,373,3],[374,0,374,3],[375,0,375,3],[376,0,376,3],[377,0,377,3],[369,0,369,3],[363,0,363,3],[357,0,357,4],[364,0,364,3],[344,0,344,3],[353,0,353,3],[355,0,355,4],[370,0,370,3],[371,0,371,3],[423,0,423,3],[424,0,424,3],[367,0,367,3],[378,0,378,3],[379,0,379,3],[393,0,393,3],[394,0,394,3],[395,0,395,3],[396,0,396,3],[397,0,397,3],[398,0,398,3],[388,0,388,3],[389,0,389,3],[380,0,380,3],[381,0,381,3],[382,0,382,3],[384,0,384,3],[385,0,385,3],[386,0,386,3],[387,0,387,3],[368,0,368,3],[404,0,404,4],[443,0,443,3],[444,0,444,3],[405,0,405,4],[407,0,407,4],[406,0,406,4],[400,0,400,2],[403,0,403,4],[425,0,425,3],[426,0,426,3],[411,0,411,3],[412,0,412,3],[413,0,413,3],[414,0,414,3],[415,0,415,3],[410,0,410,3],[401,0,401,3],[416,0,416,3],[417,0,417,3],[418,0,418,3],[419,0,419,3],[420,0,420,3],[439,0,439,3],[497,0,497,4],[500,0,500,4],[421,0,421,3],[422,0,422,3],[468,0,468,3],[427,0,427,3],[428,0,428,3],[429,0,429,3],[430,0,430,3],[431,0,431,3],[432,0,432,3],[438,0,438,3],[457,0,457,3],[458,0,458,3],[435,0,435,3],[433,0,433,3],[434,0,434,3],[456,0,456,2],[461,0,461,3],[462,0,462,3],[454,0,454,4],[436,0,436,3],[453,0,453,4],[440,0,440,3],[459,0,459,3],[463,0,463,3],[473,0,473,3],[469,0,469,3],[437,0,437,3],[391,0,391,3],[392,0,392,3],[503,0,503,2],[464,0,464,3],[489,0,489,3],[490,0,490,3],[482,0,482,3],[483,0,483,3],[484,0,484,3],[485,0,485,3],[486,0,486,3],[487,0,487,3],[476,0,476,3],[477,0,477,3],[478,0,478,3],[479,0,479,3],[480,0,480,3],[481,0,481,3],[495,0,495,3],[9,5,9,6],[189,0,189,2],[214,0,214,2],[257,0,257,2],[303,0,303,2],[15,0,15,2],[16,0,16,2],[17,0,17,2],[18,0,18,2],[19,0,19,2],[20,0,20,2],[21,0,21,2],[24,0,24,2],[22,0,22,2],[177,0,177,3],[185,0,185,3],[186,0,186,3],[187,0,187,3],[148,0,148,4],[190,0,190,3],[226,0,226,3],[175,0,175,3],[176,0,176,3],[227,0,227,3],[684,0,684,2],[662,0,662,4],[26,0,26,2],[528,0,528,3],[529,0,529,3],[530,0,530,3],[491,0,491,3],[492,0,492,3],[513,0,513,3],[178,0,178,3],[179,0,179,3],[180,0,180,3],[181,0,181,3],[182,0,182,3],[27,0,27,2],[532,0,532,3],[533,0,533,3],[154,0,154,3],[155,0,155,3],[156,0,156,3],[157,0,157,3],[158,0,158,3],[159,0,159,3],[160,0,160,3],[680,0,680,3],[523,0,523,3],[524,0,524,3],[525,0,525,3],[526,0,526,3],[527,0,527,3],[9,7,9,8],[682,0,682,3],[23,0,23,2],[25,0,25,2],[506,0,506,3],[507,0,507,3],[499,0,499,4],[531,0,531,3],[514,0,514,3],[161,0,161,3],[508,0,508,3],[509,0,509,3],[498,0,498,4],[512,0,512,3],[505,0,505,3],[460,0,460,3],[494,0,494,2],[13,0,13,2],[675,0,675,3],[676,0,676,3],[677,0,677,3],[678,0,678,3],[699,0,699,3],[700,0,700,3],[701,0,701,3],[733,0,733,2],[734,0,734,3],[723,0,723,3],[724,0,724,3],[710,0,710,2],[725,0,725,3],[726,0,726,3],[727,0,727,3],[728,0,728,3],[729,0,729,3],[730,0,730,3],[731,0,731,3],[719,0,719,3],[720,0,720,3],[721,0,721,3],[722,0,722,3],[679,0,679,3],[35,2,35,4],[552,2,552,4],[592,0,592,4],[605,0,605,2],[582,0,582,2],[690,0,690,2],[661,0,661,4],[664,0,664,2],[665,0,665,3],[666,0,666,3],[688,0,688,4],[585,0,585,2],[634,0,634,2],[657,0,657,2],[667,0,667,3],[668,0,668,3],[685,0,685,3],[669,0,669,3],[670,0,670,3],[671,0,671,3],[681,0,681,3],[672,0,672,3],[673,0,673,3],[674,0,674,3],[615,0,615,1],[616,0,616,1],[617,0,617,1],[618,0,618,1],[619,0,619,1],[620,0,620,1],[621,0,621,1],[622,0,622,1],[623,0,623,1],[624,0,624,1],[625,0,625,1],[626,0,626,1],[627,0,627,1],[628,0,628,1],[629,0,629,1],[630,0,630,1],[631,0,631,1],[632,0,632,1],[638,0,638,1],[639,0,639,1],[640,0,640,1],[641,0,641,1],[642,0,642,1],[643,0,643,1],[644,0,644,1],[645,0,645,1],[646,0,646,1],[658,0,658,3],[647,0,647,1],[648,0,648,1],[649,0,649,1],[650,0,650,1],[651,0,651,1],[652,0,652,1],[653,0,653,1],[654,0,654,1],[655,0,655,1]]}
[]
[]
["NAME OF PARISH",null,{"$f":"UPPER('Toolkit Trial Balance'!$D$24)","v":""}]
["ADDRESS",null,{"$f":"UPPER('Toolkit Trial Balance'!$D$25)","v":""}]
["CITY, STATE, ZIP CODE",null,{"$f":"UPPER('Toolkit Trial Balance'!$D$26)","v":""}]
["PARISH NUMBER",null,{"$f":"'Toolkit Trial Balance'!D27","v":0}]
["FISCAL YEAR ENDED ",null,{"$f":"'Toolkit Trial Balance'!$D$7","v":"2021-06-30"}]
[]
["This section of the Tool Kit is used to provide supplemental information regarding what is included in the related item in the Trial Balance tab and should be completed only after completion of the Trial Balance tab.  Complete the schedules indicated as directed below:"]
[null,null,null,"Is schedule\nrequired for your Parish?","Is schedule\ncomplete? ","(An amount in column E or at bottom of schedule indicates an error- please review)",null,"If parish inserts rows- GoTo will not work or will fall short of destination"]
["SCHEDULE A - CHECKING, SAVINGS AND INVESTMENT\n    ACCOUNT INFORMATION",null,null,"YES",{"$f":"IF(D11=\"YES\",  F123, \"N/A\")","v":"OK"}]
["SCHEDULE B - PAYABLE TO DIOCESE",null,null,"YES",{"$f":"IF(AND(E146='Toolkit Trial Balance'!G318,'Toolkit Trial Balance'!H430=\"OK\"), \"OK\", \"ERROR-SchB & H430TB must both = OK (unless due to an explained fund balance adj\")","v":"OK"}]
["SCHEDULE  C - DETAIL OF ACCOUNTS PAYABLE\n    AND ACCRUED EXPENSES",null,null,{"$f":"IF('Toolkit Trial Balance'!G320<>0,\"YES\",\"NO\")","v":"NO"},{"$f":"IF(D13=\"YES\", E191, \"N/A\")","v":"N/A"}]
["SCHEDULE  D - DETAIL OF LOANS, NOTES AND \n    MORTGAGES PAYABLE",null,null,{"$f":"IF('Toolkit Trial Balance'!G324<>0,\"YES\",\"NO\")","v":"NO"},{"$f":"IF(D14=\"YES\", E216, \"N/A\")","v":"N/A"}]
["SCHEDULE E - CHURCH MISCELLANEOUS\n    RECEIPTS ",null,null,{"$f":"IF('Toolkit Trial Balance'!G348<>0,\"YES\",\"NO\")","v":"NO"},{"$f":"IF(D15=\"YES\", E259, \"N/A\")","v":"N/A"}]
["SCHEDULE F - CHURCH EXTRAORDINARY\n    RECEIPTS (if total > $5,000)",null,null,{"$f":"IF('Toolkit Trial Balance'!G350>5000,\"YES\",\"NO\")","v":"NO"},{"$f":"IF(D16= \"NO\", IF(A305=\" \", \"N/A\", \"ERROR SEE SCHEDULE\"), IF(AND(D16=\"YES\", E305=\"OK\"), \"OK\", E305))","v":"N/A"}]
["SCHEDULE G - CHURCH MISCELLANEOUS EXPENSES \n    (if aggregate total of accounts  2015, 2115, 2215, \n     2315, 2415, 2515, and 2615 is > $5,000)",null,null,{"$f":"IF('Toolkit Trial Balance'!G288>5000,\"YES\",\"NO\")","v":"NO"},{"$f":"IF(D17=\"NO\",IF(A354=\" \", \"N/A\", \"ERROR SEE SCHEDULE\"), IF(AND(D17=\"YES\", E354=\"OK\"), \"OK\", E354))","v":"N/A"}]
["SCHEDULE H - CHURCH EXTRAORDINARY\n    EXPENSES (if total > $5,000)",null,null,{"$f":"IF('Toolkit Trial Balance'!G368>5000,\"YES\",\"NO\")","v":"NO"},{"$f":"IF(D18=\"NO\",IF(A402=\" \",\"N/A\",\"ERROR SEE SCHEDULE\"),IF(AND(D18=\"YES\",E402=\"OK\"),\"OK\",E402))","v":"N/A"}]
["SCHEDULE I - SCHOOL OTHER INCOME\n    (if total > $5,000)",null,null,{"$f":"IF('Toolkit Trial Balance'!G383>5000,\"YES\",\"NO\")","v":"NO"},{"$f":"IF(D19=\"NO\", IF(A449=\" \", \"N/A\", \"ERROR SEE SCHEDULE\"), IF(AND(D19=\"YES\", E449=\"OK\"), \"OK\", E449))","v":"N/A"}]
["SCHEDULE J - SCHOOL MISCELLANEOUS\n    EXPENSES (if aggregate total of accounts\n    5015, 5315, 5815, and 5915 is > $5,000)",null,null,{"$f":"IF('Toolkit Trial Balance'!G289>5000,\"YES\",\"NO\")","v":"NO"},{"$f":"IF(D20=\"NO\",IF(A496= \" \", \"N/A\", \"ERROR SEE SCHEDULE\"), IF(AND(D20=\"YES\", E496=\"OK\"), \"OK\", E496))","v":"N/A"}]
["SCHEDULE K - SCHOOL  EXTRAORDINARY\n    EXPENSES (if total > $5,000)",null,null,{"$f":"IF('Toolkit Trial Balance'!G396>5000,\"YES\",\"NO\")","v":"NO"},{"$f":"IF(D21=\"NO\",IF(A539=\" \",\"N/A\", \"ERROR SEE SCHED\"),IF(AND(D21=\"YES\",E539=\"OK\"),\"OK\",E539))","v":"N/A"}]
["SCHEDULE L - BANK ACCOUNT BALANCES\n    OF PARISH-AFFILIATED ORGANIZATIONS",null,null,"YES",{"$f":"IF(AND(C550=\"N\", E586=0),\"N/A\",(IF(AND(C550=\"y\", E586>0),\"OK\",\"PLEASE REVIEW/CORRECT\")))","v":"PLEASE REVIEW/CORRECT"}]
["SCHEDULE M -PARISH FUNDRAISING",null,null,{"$f":"IF('Toolkit Trial Balance'!G343<>0,\"YES\",\"NO\")","v":"NO"},{"$f":"IF(D23=\"YES\", E636, \"N/A\")","v":"N/A"}]
["SCHEDULE M -SCHOOL FUNDRAISING",null,null,{"$f":"IF('Toolkit Trial Balance'!G378<>0,\"YES\",\"NO\")","v":"NO"},{"$f":"IF(D24=\"YES\", E659, \"N/A\")","v":"N/A"}]
["SCHEDULE N - DEFERRED RESTRICTED SUPPORT",null,null,{"$f":"IF('Toolkit Trial Balance'!G59<>0,\"YES\",\"NO\")","v":"NO"},{"$f":"IF(D25=\"YES\", E686, \"N/A\")","v":"N/A"}]
["SCHEDULE O -PARISH RENTAL RECEIPTS",null,null,{"$f":"IF('Toolkit Trial Balance'!G346<>0,\"YES\",\"NO\")","v":"NO"},{"$f":"IF(D26=\"YES\", E712, \"N/A\")","v":"N/A"}]
["SCHEDULE P -OTHER ASSETS DETAIL",null,null,{"$f":"IF('Toolkit Trial Balance'!G314<>0,\"YES\",\"NO\")","v":"NO"},{"$f":"IF(D27=\"YES\", E735, \"N/A\")","v":"N/A"}]
["SCHEDULE Q -INCOME RECEIVED IN ADVANCE ",null,null,{"$f":"IF('Toolkit Trial Balance'!G321<>0,\"YES\",\"NO\")","v":"NO"},{"$f":"IF(D28=\"YES\", E757, \"N/A\")","v":"N/A"}]
[]
["SCHEDULE A - CHECKING, SAVINGS AND INVESTMENT ACCOUNT INFORMATION AS OF"]
{"$rows_left_out":728}
{"sheet":"Parishioner Report Template","index":2,"n_rows":128,"n_cols":4,"rows_kept":128,"cut":false,"hidden":false,"merged":[[1,0,1,3],[121,0,121,3],[0,7,1,15],[6,2,6,3],[122,1,122,2],[41,1,41,2],[5,0,5,3],[86,1,86,2],[4,0,4,3],[40,0,40,3],[85,0,85,3]]}
[]
[{"$f":"UPPER('Toolkit Trial Balance'!$D$24)","v":""}]
[]
[]
["STATEMENT OF ASSETS, LIABILITIES AND FUND BALANCE"]
["CHURCH, SCHOOL & CEMETERY"]
[null,null,"Balance at June 30,"]
[null,null,{"$f":"'Toolkit Trial Balance'!$D$7","v":"2021-06-30"},{"$f":"'Toolkit Trial Balance'!$D$8","v":"2020-06-30"}]
["ASSETS"]
["CHECKING, SAVINGS AND INVESTMENTS"]
["Checking Account Balances",null,{"$f":"'Toolkit Trial Balance'!G310","v":0},{"$f":"'Toolkit Trial Balance'!H310","v":0}]
["Savings and Investment Account Balances",null,{"$f":"'Toolkit Trial Balance'!G311","v":0},{"$f":"'Toolkit Trial Balance'!H311","v":0}]
["TOTAL CHECKING SAVINGS AND INVESTMENTS",null,{"$f":"SUM(C11:C12)","v":0},{"$f":"SUM(D11:D12)","v":0}]
["ACCOUNTS RECEIVABLE",null,{"$f":"'Toolkit Trial Balance'!G313","v":0},{"$f":"'Toolkit Trial Balance'!H313","v":0}]
["OTHER ASSETS",null,{"$f":"'Toolkit Trial Balance'!G314","v":0},{"$f":"'Toolkit Trial Balance'!H314","v":0}]
["TOTAL ASSETS",null,{"$f":"SUM(C13:C15)","v":0},{"$f":"SUM(D13:D15)","v":0}]
["LIABILITIES"]
["ACCOUNTS PAYABLE AND ACCRUED EXPENSES"]
["Payable to Diocese of Cleveland",null,{"$f":"'Toolkit Trial Balance'!G318","v":0},{"$f":"'Toolkit Trial Balance'!H318","v":0}]
["Other accounts payable and accrued expenses",null,{"$f":"'Toolkit Trial Balance'!G319","v":0},{"$f":"'Toolkit Trial Balance'!H319","v":0}]
["TOTAL ACCOUNTS PAYABLE AND ACCRUED EXPENSES",null,{"$f":"SUM(C19:C20)","v":0},{"$f":"SUM(D19:D20)","v":0}]
["INCOME RECEIVED IN ADVANCE",null,{"$f":"'Toolkit Trial Balance'!G321","v":0},{"$f":"'Toolkit Trial Balance'!H321","v":0}]
["EMPLOYEE WITHHOLDING",null,{"$f":"'Toolkit Trial Balance'!G322","v":0},{"$f":"'Toolkit Trial Balance'!H322","v":0}]
["DEFERRED RESTRICTED SUPPORT",null,{"$f":"'Toolkit Trial Balance'!G323","v":0},{"$f":"'Toolkit Trial Balance'!H323","v":0}]
["LOANS, NOTES AND MORTGAGES PAYABLE",null,{"$f":"'Toolkit Trial Balance'!G324","v":0},{"$f":"'Toolkit Trial Balance'!H324","v":0}]
["TOTAL LIABILITIES",null,{"$f":"SUM(C21:C25)","v":0},{"$f":"SUM(D21:D25)","v":0}]
[]
["FUND BALANCE"]
["FUND BALANCE BEGINNING OF FISCAL YEAR",null,{"$f":"'Toolkit Trial Balance'!G327","v":0},{"$f":"'Toolkit Trial Balance'!H327","v":0}]
["Net Surplus (Deficit) for Fiscal Year"]
{"$rows_left_out":99}
{"sheet":"YE Memo & Rest. Definitions","index":3,"n_rows":5,"n_cols":11,"rows_kept":5,"cut":false,"hidden":false,"merged":[]}
[]
[null,null,null,null,null,null,null,null,null,null,"TO OPEN ALL PAGES OF MEMO"]
[null,null,null,null,null,null,null,null,null,null,"right click on memo "]
[null,null,null,null,null,null,null,null,null,null,"choose Document Object (or Acrobat Document Object)"]
[null,null,null,null,null,null,null,null,null,null,"choose open"]